Build failed in Jenkins: lintian-tests_stretch-backports #896

classic Classic list List threaded Threaded
4 messages Options
Reply | Threaded
Open this post in threaded view
|

Build failed in Jenkins: lintian-tests_stretch-backports #896

jenkins
See <https://jenkins.debian.net/job/lintian-tests_stretch-backports/896/display/redirect>

------------------------------------------
[...truncated 221.92 KB...]
Adding debian:Baltimore_CyberTrust_Root.pem
Adding debian:Autoridad_de_Certificacion_Firmaprofesional_CIF_A62634068.pem
Adding debian:Atos_TrustedRoot_2011.pem
Adding debian:Amazon_Root_CA_4.pem
Adding debian:Amazon_Root_CA_3.pem
Adding debian:Amazon_Root_CA_2.pem
Adding debian:Amazon_Root_CA_1.pem
Adding debian:AffirmTrust_Premium_ECC.pem
Adding debian:AffirmTrust_Premium.pem
Adding debian:AffirmTrust_Networking.pem
Adding debian:AffirmTrust_Commercial.pem
Adding debian:AddTrust_Low-Value_Services_Root.pem
Adding debian:AddTrust_External_Root.pem
Adding debian:Actalis_Authentication_Root_CA.pem
Warning: there was a problem reading the certificate file /etc/ssl/certs/AC_Ra?z_Certic?mara_S.A..pem. Message:
  /etc/ssl/certs/AC_Ra?z_Certic?mara_S.A..pem (No such file or directory)
Adding debian:AC_RAIZ_FNMT-RCM.pem
Adding debian:ACCVRAIZ1.pem
done.
Setting up dh-autoreconf (17~bpo9+1) ...
Setting up openjdk-8-jdk-headless:amd64 (8u181-b13-2~deb9u1) ...
update-alternatives: using /usr/lib/jvm/java-8-openjdk-amd64/bin/idlj to provide /usr/bin/idlj (idlj) in auto mode
update-alternatives: using /usr/lib/jvm/java-8-openjdk-amd64/bin/jdeps to provide /usr/bin/jdeps (jdeps) in auto mode
update-alternatives: using /usr/lib/jvm/java-8-openjdk-amd64/bin/wsimport to provide /usr/bin/wsimport (wsimport) in auto mode
update-alternatives: using /usr/lib/jvm/java-8-openjdk-amd64/bin/rmic to provide /usr/bin/rmic (rmic) in auto mode
update-alternatives: using /usr/lib/jvm/java-8-openjdk-amd64/bin/jinfo to provide /usr/bin/jinfo (jinfo) in auto mode
update-alternatives: using /usr/lib/jvm/java-8-openjdk-amd64/bin/jsadebugd to provide /usr/bin/jsadebugd (jsadebugd) in auto mode
update-alternatives: using /usr/lib/jvm/java-8-openjdk-amd64/bin/native2ascii to provide /usr/bin/native2ascii (native2ascii) in auto mode
update-alternatives: using /usr/lib/jvm/java-8-openjdk-amd64/bin/jstat to provide /usr/bin/jstat (jstat) in auto mode
update-alternatives: using /usr/lib/jvm/java-8-openjdk-amd64/bin/javac to provide /usr/bin/javac (javac) in auto mode
update-alternatives: using /usr/lib/jvm/java-8-openjdk-amd64/bin/javah to provide /usr/bin/javah (javah) in auto mode
update-alternatives: using /usr/lib/jvm/java-8-openjdk-amd64/bin/jstack to provide /usr/bin/jstack (jstack) in auto mode
update-alternatives: using /usr/lib/jvm/java-8-openjdk-amd64/bin/jrunscript to provide /usr/bin/jrunscript (jrunscript) in auto mode
update-alternatives: using /usr/lib/jvm/java-8-openjdk-amd64/bin/javadoc to provide /usr/bin/javadoc (javadoc) in auto mode
update-alternatives: using /usr/lib/jvm/java-8-openjdk-amd64/bin/javap to provide /usr/bin/javap (javap) in auto mode
update-alternatives: using /usr/lib/jvm/java-8-openjdk-amd64/bin/jar to provide /usr/bin/jar (jar) in auto mode
update-alternatives: using /usr/lib/jvm/java-8-openjdk-amd64/bin/extcheck to provide /usr/bin/extcheck (extcheck) in auto mode
update-alternatives: using /usr/lib/jvm/java-8-openjdk-amd64/bin/schemagen to provide /usr/bin/schemagen (schemagen) in auto mode
update-alternatives: using /usr/lib/jvm/java-8-openjdk-amd64/bin/jps to provide /usr/bin/jps (jps) in auto mode
update-alternatives: using /usr/lib/jvm/java-8-openjdk-amd64/bin/xjc to provide /usr/bin/xjc (xjc) in auto mode
update-alternatives: using /usr/lib/jvm/java-8-openjdk-amd64/bin/jarsigner to provide /usr/bin/jarsigner (jarsigner) in auto mode
update-alternatives: using /usr/lib/jvm/java-8-openjdk-amd64/bin/jmap to provide /usr/bin/jmap (jmap) in auto mode
update-alternatives: using /usr/lib/jvm/java-8-openjdk-amd64/bin/jstatd to provide /usr/bin/jstatd (jstatd) in auto mode
update-alternatives: using /usr/lib/jvm/java-8-openjdk-amd64/bin/jhat to provide /usr/bin/jhat (jhat) in auto mode
update-alternatives: using /usr/lib/jvm/java-8-openjdk-amd64/bin/jdb to provide /usr/bin/jdb (jdb) in auto mode
update-alternatives: using /usr/lib/jvm/java-8-openjdk-amd64/bin/serialver to provide /usr/bin/serialver (serialver) in auto mode
update-alternatives: using /usr/lib/jvm/java-8-openjdk-amd64/bin/wsgen to provide /usr/bin/wsgen (wsgen) in auto mode
update-alternatives: using /usr/lib/jvm/java-8-openjdk-amd64/bin/jcmd to provide /usr/bin/jcmd (jcmd) in auto mode
Setting up default-jre-headless (2:1.8-58) ...
Setting up default-jdk-headless (2:1.8-58) ...
Setting up debhelper (12.1.1~bpo9+1) ...
Setting up pkg-php-tools (1.35) ...
Setting up dh-elpa (1.6) ...
Setting up javahelper (0.59) ...
Setting up lintian-build-deps (2.5.66) ...
Processing triggers for libc-bin (2.24-11+deb9u4) ...
Processing triggers for systemd (232-25+deb9u8) ...
Processing triggers for dictionaries-common (1.27.2) ...
aspell-autobuildhash: processing: en [en-common].
aspell-autobuildhash: processing: en [en-variant_0].
aspell-autobuildhash: processing: en [en-variant_1].
aspell-autobuildhash: processing: en [en-variant_2].
aspell-autobuildhash: processing: en [en-w_accents-only].
aspell-autobuildhash: processing: en [en-wo_accents-only].
aspell-autobuildhash: processing: en [en_AU-variant_0].
aspell-autobuildhash: processing: en [en_AU-variant_1].
aspell-autobuildhash: processing: en [en_AU-w_accents-only].
aspell-autobuildhash: processing: en [en_AU-wo_accents-only].
aspell-autobuildhash: processing: en [en_CA-variant_0].
aspell-autobuildhash: processing: en [en_CA-variant_1].
aspell-autobuildhash: processing: en [en_CA-w_accents-only].
aspell-autobuildhash: processing: en [en_CA-wo_accents-only].
aspell-autobuildhash: processing: en [en_GB-ise-w_accents-only].
aspell-autobuildhash: processing: en [en_GB-ise-wo_accents-only].
aspell-autobuildhash: processing: en [en_GB-ize-w_accents-only].
aspell-autobuildhash: processing: en [en_GB-ize-wo_accents-only].
aspell-autobuildhash: processing: en [en_GB-variant_0].
aspell-autobuildhash: processing: en [en_GB-variant_1].
aspell-autobuildhash: processing: en [en_US-w_accents-only].
aspell-autobuildhash: processing: en [en_US-wo_accents-only].
Processing triggers for ca-certificates (20161130+nmu1+deb9u1) ...
Updating certificates in /etc/ssl/certs...
0 added, 0 removed; done.
Running hooks in /etc/ca-certificates/update.d...

done.
done.
.... running tests ....
mkdir -p "/tmp/testrun/debian/test-out"
t/runtests -k  t "/tmp/testrun/debian/test-out"
ENV[PATH]=/usr/local/sbin:/usr/local/bin:/usr/sbin:/usr/bin:/sbin:/bin
Test scripts:
t/scripts/02-minimum-version/docs-examples.t ....... ok
t/scripts/03-strict/helpers.t ...................... ok
t/scripts/02-minimum-version/helpers.t ............. ok
t/scripts/01-critic/commands.t ..................... skipped: Perl::Tidy 20170521 required to run this test
t/scripts/03-strict/docs-examples.t ................ ok
t/scripts/03-strict/frontend.t ..................... ok
t/scripts/01-critic/frontend.t ..................... skipped: Perl::Tidy 20170521 required to run this test
t/scripts/01-critic/docs-examples.t ................ skipped: Perl::Tidy 20170521 required to run this test
t/scripts/Lintian/DepMap/01add-select-satisfy.t .... ok
t/scripts/01-critic/test-scripts.t ................. skipped: Perl::Tidy 20170521 required to run this test
t/scripts/Lintian/DepMap/05multi-add.t ............. ok
t/scripts/Lintian/DepMap/08initialise.t ............ ok
t/scripts/Lintian/DepMap/03pending.t ............... ok
t/scripts/Lintian/DepMap/04satisfiability.t ........ ok
t/scripts/Lintian/DepMap/06parents.t ............... ok
t/scripts/01-critic/checks.t ....................... skipped: Perl::Tidy 20170521 required to run this test
t/scripts/01-critic/collection.t ................... skipped: Perl::Tidy 20170521 required to run this test
t/scripts/Lintian/DepMap/11prefix.t ................ ok
t/scripts/Lintian/DepMap/10circular.t .............. ok
t/scripts/01-critic/lib.t .......................... skipped: Perl::Tidy 20170521 required to run this test
t/scripts/Lintian/DepMap/08initialise2.t ........... ok
t/scripts/Lintian/DepMap/09unlink.t ................ ok
t/scripts/Lintian/Lab/Manifest/01-basic.t .......... ok
t/scripts/01-critic/private.t ...................... skipped: Perl::Tidy 20170521 required to run this test
t/scripts/01-critic/helpers.t ...................... skipped: Perl::Tidy 20170521 required to run this test
t/scripts/Lintian/Relation/01-basic.t .............. ok
t/scripts/Lintian/Relation/02-architecture.t ....... ok
t/scripts/Lintian/Lab/Manifest/02-io.t ............. ok
t/scripts/Lintian/DepMap/12done.t .................. ok
t/scripts/Lintian/DepMap/Properties/00construct.t .. ok
t/scripts/Lintian/Lab/Manifest/03-diff.t ........... ok
t/scripts/Lintian/Relation/03-duplicates.t ......... ok
t/scripts/Lintian/Relation/05-invalid.t ............ ok
t/scripts/Lintian/Relation/06-build-profiles.t ..... ok
t/scripts/Lintian/Relation/04-multiarch.t .......... ok
t/scripts/Lintian/Relation/07-implies.t ............ ok
t/scripts/Lintian/Lab/auto-repair.t ................ ok
t/scripts/Lintian/Util/dctrl-parser.t .............. ok
t/scripts/Lintian/Util/path.t ...................... ok
t/scripts/Lintian/Util/parse_bool.t ................ ok
t/scripts/Lintian/Util/run_cmd.t ................... ok
t/scripts/Lintian/Lab/repair.t ..................... ok

#   Failed test 'ANCIENT_DATE is up to date'
#   at t/scripts/ancient-sv-date.t line 50.
#     '1492320456'
#         <
#     '1451260800'
#  * Please update data/standards-version/ancient-date
# Looks like you failed 1 test of 2.
t/scripts/ancient-sv-date.t ........................
Dubious, test returned 1 (wstat 256, 0x100)
Failed 1/2 subtests
t/scripts/changelog-format.t ....................... ok
t/scripts/needs-info-missing.t ..................... ok
t/scripts/pod-coverage.t ........................... ok
t/scripts/needs-info-exists.t ...................... ok
t/scripts/profiles-coverage.t ...................... ok
t/scripts/version.t ................................ ok
t/scripts/unpack-level.t ........................... ok
t/scripts/implemented-tags.t ....................... ok
t/scripts/static-lab.t ............................. ok
t/scripts/pod.t .................................... ok
t/scripts/pod-synopsis.t ........................... ok
t/scripts/03-strict/commands.t ..................... ok
t/scripts/02-minimum-version/frontend.t ............ ok
t/scripts/check-load.t ............................. ok
t/scripts/profile-load.t ........................... ok
t/scripts/03-strict/collection.t ................... ok
t/scripts/03-strict/private.t ...................... ok
t/scripts/02-minimum-version/collection.t .......... ok
t/scripts/spellintian.t ............................ ok
t/scripts/check-descs.t ............................ ok
t/scripts/02-minimum-version/private.t ............. ok
t/scripts/pod-spelling.t ........................... ok
t/scripts/03-strict/lib.t .......................... ok
t/scripts/02-minimum-version/commands.t ............ ok
t/scripts/02-minimum-version/test-scripts.t ........ ok
t/scripts/03-strict/checks.t ....................... ok
t/scripts/03-strict/test-scripts.t ................. ok
t/scripts/02-minimum-version/lib.t ................. ok
t/scripts/02-minimum-version/checks.t .............. ok

Test Summary Report
-------------------
t/scripts/ancient-sv-date.t                      (Wstat: 256 Tests: 2 Failed: 1)
  Failed test:  1
  Non-zero exit status: 1
Files=72, Tests=19380, 57 wallclock secs ( 3.51 usr  0.53 sys + 217.08 cusr 47.74 csys = 268.86 CPU)
Result: FAIL

.............S.......................................S.........................T
..T.........S................................S..................................
....................................S............S.S............................
.........
tests::elpa: ---- START BUILD LOG
tests::elpa: dpkg-buildpackage: warning: using a gain-root-command while being root
tests::elpa: dpkg-buildpackage: info: source package elpa
tests::elpa: dpkg-buildpackage: info: source version 1.0-1
tests::elpa: dpkg-buildpackage: info: source distribution unstable
tests::elpa: dpkg-buildpackage: info: source changed by Debian Lintian Maintainers <[hidden email]>
tests::elpa:  dpkg-source -iNEVER_MATCH_ANYTHING -INEVER_MATCH_ANYTHING --auto-commit --before-build elpa-1.0
tests::elpa: dpkg-buildpackage: info: host architecture amd64
tests::elpa: dpkg-source: warning: unknown information field 'Rules-Requires-Root' in input data in general section of control info file
tests::elpa: dpkg-source: warning: --auto-commit is not a valid option for Dpkg::Source::Package::V1
tests::elpa:  fakeroot debian/rules clean
tests::elpa: dh clean --with elpa
tests::elpa:    dh_clean
tests::elpa:  dpkg-source -iNEVER_MATCH_ANYTHING -INEVER_MATCH_ANYTHING --auto-commit -b elpa-1.0
tests::elpa: dpkg-source: warning: unknown information field 'Rules-Requires-Root' in input data in general section of control info file
tests::elpa: dpkg-source: warning: --auto-commit is not a valid option for Dpkg::Source::Package::V1
tests::elpa: dpkg-source: info: using source format '1.0'
tests::elpa: dpkg-source: info: building elpa using existing elpa_1.0.orig.tar.gz
tests::elpa: dpkg-source: info: building elpa in elpa_1.0-1.diff.gz
tests::elpa: dpkg-source: warning: executable mode 0755 of 'debian/tests/test' will not be represented in diff
tests::elpa: dpkg-source: warning: the diff modifies the following upstream files:
tests::elpa:  foo.el
tests::elpa: dpkg-source: info: use the '3.0 (quilt)' format to have separate and documented changes to upstream files, see dpkg-source(1)
tests::elpa: dpkg-source: info: building elpa in elpa_1.0-1.dsc
tests::elpa:  debian/rules build
tests::elpa: dh build --with elpa
tests::elpa:    dh_update_autotools_config
tests::elpa:    dh_autoreconf
tests::elpa:    dh_elpa_test
tests::elpa: Invalid field given (Rules_Requires_Root) at /usr/share/perl5/Debian/Control.pm line 122.
tests::elpa: debian/rules:4: recipe for target 'build' failed
tests::elpa: make: *** [build] Error 255
tests::elpa: dpkg-buildpackage: error: debian/rules build gave error exit status 2
tests::elpa: ---- END BUILD LOG
error tests::elpa: internal error: cd /tmp/testrun/debian/test-out/tests/elpa/elpa-1.0 && dpkg-buildpackage -rfakeroot -us -uc -d -iNEVER_MATCH_ANYTHING -INEVER_MATCH_ANYTHING --source-option=--auto-commit >/tmp/testrun/debian/test-out/tests/elpa/build.elpa 2>&1 at t/runtests line 466.

................................................................................
................................................................................
....................................................................S...........
..............................S......S..........................................
....
Skipped/disabled tests:
  [debs]
    deb-format-wrong-order: Unmet test dependencies: dpkg (<< 1.17.2)
  [tests]
    binaries-missing-lfs: architecture mismatch
    changelog-file-strange-date: Unmet test dependencies: dpkg (<< 1.18.2)
    deb-format-udeb-compression: Unmet test dependencies: dpkg (<< 1.18.11)
    debhelper-compat: Unmet test dependencies: debhelper (<< 9.20151101~)
    debhelper-compat-empty: Unmet test dependencies: debhelper (<< 9.20151101~)
    runtests-arch-i386: architecture mismatch
    shared-libs-non-pic-i386: architecture mismatch
    upstream-metadata-invalid-yml: (disabled) YAML::XS executes code by default and code has not been converted
    version-substvars-obsolete: Unmet test dependencies: dpkg (<< 1.17.2)

Failed tests (2)
    suite:scripts [Try: prove -lr -j24 t]
    tests::elpa
debian/rules:48: recipe for target 'runtests' failed
make: *** [runtests] Error 1
Tue 16 Apr 05:33:21 UTC 2019 - /srv/jenkins/bin/chroot-run.sh stopped running as /tmp/jenkins-script-1mhRDS91, which will now be removed.
Build step 'Execute shell' marked build as failure

Reply | Threaded
Open this post in threaded view
|

Build failed in Jenkins: lintian-tests_stretch-backports #897

jenkins
See <https://jenkins.debian.net/job/lintian-tests_stretch-backports/897/display/redirect>

------------------------------------------
[...truncated 221.88 KB...]
Adding debian:Baltimore_CyberTrust_Root.pem
Adding debian:Autoridad_de_Certificacion_Firmaprofesional_CIF_A62634068.pem
Adding debian:Atos_TrustedRoot_2011.pem
Adding debian:Amazon_Root_CA_4.pem
Adding debian:Amazon_Root_CA_3.pem
Adding debian:Amazon_Root_CA_2.pem
Adding debian:Amazon_Root_CA_1.pem
Adding debian:AffirmTrust_Premium_ECC.pem
Adding debian:AffirmTrust_Premium.pem
Adding debian:AffirmTrust_Networking.pem
Adding debian:AffirmTrust_Commercial.pem
Adding debian:AddTrust_Low-Value_Services_Root.pem
Adding debian:AddTrust_External_Root.pem
Adding debian:Actalis_Authentication_Root_CA.pem
Warning: there was a problem reading the certificate file /etc/ssl/certs/AC_Ra?z_Certic?mara_S.A..pem. Message:
  /etc/ssl/certs/AC_Ra?z_Certic?mara_S.A..pem (No such file or directory)
Adding debian:AC_RAIZ_FNMT-RCM.pem
Adding debian:ACCVRAIZ1.pem
done.
Setting up dh-autoreconf (17~bpo9+1) ...
Setting up openjdk-8-jdk-headless:amd64 (8u181-b13-2~deb9u1) ...
update-alternatives: using /usr/lib/jvm/java-8-openjdk-amd64/bin/idlj to provide /usr/bin/idlj (idlj) in auto mode
update-alternatives: using /usr/lib/jvm/java-8-openjdk-amd64/bin/jdeps to provide /usr/bin/jdeps (jdeps) in auto mode
update-alternatives: using /usr/lib/jvm/java-8-openjdk-amd64/bin/wsimport to provide /usr/bin/wsimport (wsimport) in auto mode
update-alternatives: using /usr/lib/jvm/java-8-openjdk-amd64/bin/rmic to provide /usr/bin/rmic (rmic) in auto mode
update-alternatives: using /usr/lib/jvm/java-8-openjdk-amd64/bin/jinfo to provide /usr/bin/jinfo (jinfo) in auto mode
update-alternatives: using /usr/lib/jvm/java-8-openjdk-amd64/bin/jsadebugd to provide /usr/bin/jsadebugd (jsadebugd) in auto mode
update-alternatives: using /usr/lib/jvm/java-8-openjdk-amd64/bin/native2ascii to provide /usr/bin/native2ascii (native2ascii) in auto mode
update-alternatives: using /usr/lib/jvm/java-8-openjdk-amd64/bin/jstat to provide /usr/bin/jstat (jstat) in auto mode
update-alternatives: using /usr/lib/jvm/java-8-openjdk-amd64/bin/javac to provide /usr/bin/javac (javac) in auto mode
update-alternatives: using /usr/lib/jvm/java-8-openjdk-amd64/bin/javah to provide /usr/bin/javah (javah) in auto mode
update-alternatives: using /usr/lib/jvm/java-8-openjdk-amd64/bin/jstack to provide /usr/bin/jstack (jstack) in auto mode
update-alternatives: using /usr/lib/jvm/java-8-openjdk-amd64/bin/jrunscript to provide /usr/bin/jrunscript (jrunscript) in auto mode
update-alternatives: using /usr/lib/jvm/java-8-openjdk-amd64/bin/javadoc to provide /usr/bin/javadoc (javadoc) in auto mode
update-alternatives: using /usr/lib/jvm/java-8-openjdk-amd64/bin/javap to provide /usr/bin/javap (javap) in auto mode
update-alternatives: using /usr/lib/jvm/java-8-openjdk-amd64/bin/jar to provide /usr/bin/jar (jar) in auto mode
update-alternatives: using /usr/lib/jvm/java-8-openjdk-amd64/bin/extcheck to provide /usr/bin/extcheck (extcheck) in auto mode
update-alternatives: using /usr/lib/jvm/java-8-openjdk-amd64/bin/schemagen to provide /usr/bin/schemagen (schemagen) in auto mode
update-alternatives: using /usr/lib/jvm/java-8-openjdk-amd64/bin/jps to provide /usr/bin/jps (jps) in auto mode
update-alternatives: using /usr/lib/jvm/java-8-openjdk-amd64/bin/xjc to provide /usr/bin/xjc (xjc) in auto mode
update-alternatives: using /usr/lib/jvm/java-8-openjdk-amd64/bin/jarsigner to provide /usr/bin/jarsigner (jarsigner) in auto mode
update-alternatives: using /usr/lib/jvm/java-8-openjdk-amd64/bin/jmap to provide /usr/bin/jmap (jmap) in auto mode
update-alternatives: using /usr/lib/jvm/java-8-openjdk-amd64/bin/jstatd to provide /usr/bin/jstatd (jstatd) in auto mode
update-alternatives: using /usr/lib/jvm/java-8-openjdk-amd64/bin/jhat to provide /usr/bin/jhat (jhat) in auto mode
update-alternatives: using /usr/lib/jvm/java-8-openjdk-amd64/bin/jdb to provide /usr/bin/jdb (jdb) in auto mode
update-alternatives: using /usr/lib/jvm/java-8-openjdk-amd64/bin/serialver to provide /usr/bin/serialver (serialver) in auto mode
update-alternatives: using /usr/lib/jvm/java-8-openjdk-amd64/bin/wsgen to provide /usr/bin/wsgen (wsgen) in auto mode
update-alternatives: using /usr/lib/jvm/java-8-openjdk-amd64/bin/jcmd to provide /usr/bin/jcmd (jcmd) in auto mode
Setting up default-jre-headless (2:1.8-58) ...
Setting up default-jdk-headless (2:1.8-58) ...
Setting up debhelper (12.1.1~bpo9+1) ...
Setting up pkg-php-tools (1.35) ...
Setting up dh-elpa (1.6) ...
Setting up javahelper (0.59) ...
Setting up lintian-build-deps (2.5.66) ...
Processing triggers for libc-bin (2.24-11+deb9u4) ...
Processing triggers for systemd (232-25+deb9u8) ...
Processing triggers for dictionaries-common (1.27.2) ...
aspell-autobuildhash: processing: en [en-common].
aspell-autobuildhash: processing: en [en-variant_0].
aspell-autobuildhash: processing: en [en-variant_1].
aspell-autobuildhash: processing: en [en-variant_2].
aspell-autobuildhash: processing: en [en-w_accents-only].
aspell-autobuildhash: processing: en [en-wo_accents-only].
aspell-autobuildhash: processing: en [en_AU-variant_0].
aspell-autobuildhash: processing: en [en_AU-variant_1].
aspell-autobuildhash: processing: en [en_AU-w_accents-only].
aspell-autobuildhash: processing: en [en_AU-wo_accents-only].
aspell-autobuildhash: processing: en [en_CA-variant_0].
aspell-autobuildhash: processing: en [en_CA-variant_1].
aspell-autobuildhash: processing: en [en_CA-w_accents-only].
aspell-autobuildhash: processing: en [en_CA-wo_accents-only].
aspell-autobuildhash: processing: en [en_GB-ise-w_accents-only].
aspell-autobuildhash: processing: en [en_GB-ise-wo_accents-only].
aspell-autobuildhash: processing: en [en_GB-ize-w_accents-only].
aspell-autobuildhash: processing: en [en_GB-ize-wo_accents-only].
aspell-autobuildhash: processing: en [en_GB-variant_0].
aspell-autobuildhash: processing: en [en_GB-variant_1].
aspell-autobuildhash: processing: en [en_US-w_accents-only].
aspell-autobuildhash: processing: en [en_US-wo_accents-only].
Processing triggers for ca-certificates (20161130+nmu1+deb9u1) ...
Updating certificates in /etc/ssl/certs...
0 added, 0 removed; done.
Running hooks in /etc/ca-certificates/update.d...

done.
done.
.... running tests ....
mkdir -p "/tmp/testrun/debian/test-out"
t/runtests -k  t "/tmp/testrun/debian/test-out"
ENV[PATH]=/usr/local/sbin:/usr/local/bin:/usr/sbin:/usr/bin:/sbin:/bin
Test scripts:
t/scripts/01-critic/docs-examples.t ................ skipped: Perl::Tidy 20170521 required to run this test
t/scripts/01-critic/collection.t ................... skipped: Perl::Tidy 20170521 required to run this test
t/scripts/03-strict/helpers.t ...................... ok
t/scripts/02-minimum-version/docs-examples.t ....... ok
t/scripts/Lintian/DepMap/01add-select-satisfy.t .... ok
t/scripts/03-strict/frontend.t ..................... ok
t/scripts/01-critic/helpers.t ...................... skipped: Perl::Tidy 20170521 required to run this test
t/scripts/03-strict/docs-examples.t ................ ok
t/scripts/01-critic/frontend.t ..................... skipped: Perl::Tidy 20170521 required to run this test
t/scripts/01-critic/lib.t .......................... skipped: Perl::Tidy 20170521 required to run this test
t/scripts/01-critic/test-scripts.t ................. skipped: Perl::Tidy 20170521 required to run this test
t/scripts/Lintian/DepMap/03pending.t ............... ok
t/scripts/02-minimum-version/helpers.t ............. ok
t/scripts/Lintian/DepMap/05multi-add.t ............. ok
t/scripts/01-critic/checks.t ....................... skipped: Perl::Tidy 20170521 required to run this test
t/scripts/Lintian/DepMap/08initialise2.t ........... ok
t/scripts/Lintian/DepMap/04satisfiability.t ........ ok
t/scripts/Lintian/DepMap/09unlink.t ................ ok
t/scripts/Lintian/DepMap/06parents.t ............... ok
t/scripts/Lintian/Lab/Manifest/02-io.t ............. ok
t/scripts/Lintian/DepMap/08initialise.t ............ ok
t/scripts/01-critic/commands.t ..................... skipped: Perl::Tidy 20170521 required to run this test
t/scripts/Lintian/Lab/Manifest/01-basic.t .......... ok
t/scripts/Lintian/Lab/Manifest/03-diff.t ........... ok
t/scripts/Lintian/DepMap/10circular.t .............. ok
t/scripts/Lintian/DepMap/11prefix.t ................ ok
t/scripts/Lintian/Relation/01-basic.t .............. ok
t/scripts/Lintian/Relation/02-architecture.t ....... ok
t/scripts/Lintian/Relation/03-duplicates.t ......... ok
t/scripts/Lintian/DepMap/12done.t .................. ok
t/scripts/Lintian/DepMap/Properties/00construct.t .. ok
t/scripts/Lintian/Relation/06-build-profiles.t ..... ok
t/scripts/Lintian/Relation/05-invalid.t ............ ok
t/scripts/01-critic/private.t ...................... skipped: Perl::Tidy 20170521 required to run this test
t/scripts/Lintian/Relation/04-multiarch.t .......... ok
t/scripts/Lintian/Relation/07-implies.t ............ ok
t/scripts/Lintian/Util/dctrl-parser.t .............. ok
t/scripts/Lintian/Util/parse_bool.t ................ ok
t/scripts/Lintian/Lab/auto-repair.t ................ ok
t/scripts/Lintian/Util/run_cmd.t ................... ok
t/scripts/Lintian/Util/path.t ...................... ok
t/scripts/Lintian/Lab/repair.t ..................... ok

#   Failed test 'ANCIENT_DATE is up to date'
#   at t/scripts/ancient-sv-date.t line 50.
#     '1492332434'
#         <
#     '1451260800'
#  * Please update data/standards-version/ancient-date
# Looks like you failed 1 test of 2.
t/scripts/ancient-sv-date.t ........................
Dubious, test returned 1 (wstat 256, 0x100)
Failed 1/2 subtests
t/scripts/needs-info-exists.t ...................... ok
t/scripts/needs-info-missing.t ..................... ok
t/scripts/changelog-format.t ....................... ok
t/scripts/pod-coverage.t ........................... ok
t/scripts/implemented-tags.t ....................... ok
t/scripts/pod.t .................................... ok
t/scripts/version.t ................................ ok
t/scripts/profiles-coverage.t ...................... ok
t/scripts/unpack-level.t ........................... ok
t/scripts/pod-synopsis.t ........................... ok
t/scripts/03-strict/commands.t ..................... ok
t/scripts/check-load.t ............................. ok
t/scripts/static-lab.t ............................. ok
t/scripts/profile-load.t ........................... ok
t/scripts/02-minimum-version/frontend.t ............ ok
t/scripts/03-strict/private.t ...................... ok
t/scripts/03-strict/collection.t ................... ok
t/scripts/02-minimum-version/collection.t .......... ok
t/scripts/spellintian.t ............................ ok
t/scripts/check-descs.t ............................ ok
t/scripts/02-minimum-version/private.t ............. ok
t/scripts/pod-spelling.t ........................... ok
t/scripts/03-strict/lib.t .......................... ok
t/scripts/02-minimum-version/test-scripts.t ........ ok
t/scripts/02-minimum-version/commands.t ............ ok
t/scripts/03-strict/checks.t ....................... ok
t/scripts/03-strict/test-scripts.t ................. ok
t/scripts/02-minimum-version/lib.t ................. ok
t/scripts/02-minimum-version/checks.t .............. ok

Test Summary Report
-------------------
t/scripts/ancient-sv-date.t                      (Wstat: 256 Tests: 2 Failed: 1)
  Failed test:  1
  Non-zero exit status: 1
Files=72, Tests=19380, 60 wallclock secs ( 3.79 usr  0.53 sys + 226.31 cusr 40.01 csys = 270.64 CPU)
Result: FAIL

........S............................................S.........................T
T...........S.................................S.................................
......................................S..........SS.............................
.........
tests::elpa: ---- START BUILD LOG
tests::elpa: dpkg-buildpackage: warning: using a gain-root-command while being root
tests::elpa: dpkg-buildpackage: info: source package elpa
tests::elpa: dpkg-buildpackage: info: source version 1.0-1
tests::elpa: dpkg-buildpackage: info: source distribution unstable
tests::elpa: dpkg-buildpackage: info: source changed by Debian Lintian Maintainers <[hidden email]>
tests::elpa:  dpkg-source -iNEVER_MATCH_ANYTHING -INEVER_MATCH_ANYTHING --auto-commit --before-build elpa-1.0
tests::elpa: dpkg-buildpackage: info: host architecture amd64
tests::elpa: dpkg-source: warning: unknown information field 'Rules-Requires-Root' in input data in general section of control info file
tests::elpa: dpkg-source: warning: --auto-commit is not a valid option for Dpkg::Source::Package::V1
tests::elpa:  fakeroot debian/rules clean
tests::elpa: dh clean --with elpa
tests::elpa:    dh_clean
tests::elpa:  dpkg-source -iNEVER_MATCH_ANYTHING -INEVER_MATCH_ANYTHING --auto-commit -b elpa-1.0
tests::elpa: dpkg-source: warning: unknown information field 'Rules-Requires-Root' in input data in general section of control info file
tests::elpa: dpkg-source: warning: --auto-commit is not a valid option for Dpkg::Source::Package::V1
tests::elpa: dpkg-source: info: using source format '1.0'
tests::elpa: dpkg-source: info: building elpa using existing elpa_1.0.orig.tar.gz
tests::elpa: dpkg-source: info: building elpa in elpa_1.0-1.diff.gz
tests::elpa: dpkg-source: warning: executable mode 0755 of 'debian/tests/test' will not be represented in diff
tests::elpa: dpkg-source: warning: the diff modifies the following upstream files:
tests::elpa:  foo.el
tests::elpa: dpkg-source: info: use the '3.0 (quilt)' format to have separate and documented changes to upstream files, see dpkg-source(1)
tests::elpa: dpkg-source: info: building elpa in elpa_1.0-1.dsc
tests::elpa:  debian/rules build
tests::elpa: dh build --with elpa
tests::elpa:    dh_update_autotools_config
tests::elpa:    dh_autoreconf
tests::elpa:    dh_elpa_test
tests::elpa: Invalid field given (Rules_Requires_Root) at /usr/share/perl5/Debian/Control.pm line 122.
tests::elpa: debian/rules:4: recipe for target 'build' failed
tests::elpa: make: *** [build] Error 255
tests::elpa: dpkg-buildpackage: error: debian/rules build gave error exit status 2
tests::elpa: ---- END BUILD LOG
error tests::elpa: internal error: cd /tmp/testrun/debian/test-out/tests/elpa/elpa-1.0 && dpkg-buildpackage -rfakeroot -us -uc -d -iNEVER_MATCH_ANYTHING -INEVER_MATCH_ANYTHING --source-option=--auto-commit >/tmp/testrun/debian/test-out/tests/elpa/build.elpa 2>&1 at t/runtests line 466.

................................................................................
................................................................................
....................................................................S...........
..............................S......S..........................................
....
Skipped/disabled tests:
  [debs]
    deb-format-wrong-order: Unmet test dependencies: dpkg (<< 1.17.2)
  [tests]
    binaries-missing-lfs: architecture mismatch
    changelog-file-strange-date: Unmet test dependencies: dpkg (<< 1.18.2)
    deb-format-udeb-compression: Unmet test dependencies: dpkg (<< 1.18.11)
    debhelper-compat: Unmet test dependencies: debhelper (<< 9.20151101~)
    debhelper-compat-empty: Unmet test dependencies: debhelper (<< 9.20151101~)
    runtests-arch-i386: architecture mismatch
    shared-libs-non-pic-i386: architecture mismatch
    upstream-metadata-invalid-yml: (disabled) YAML::XS executes code by default and code has not been converted
    version-substvars-obsolete: Unmet test dependencies: dpkg (<< 1.17.2)

Failed tests (2)
    suite:scripts [Try: prove -lr -j24 t]
    tests::elpa
debian/rules:48: recipe for target 'runtests' failed
make: *** [runtests] Error 1
Tue 16 Apr 08:53:18 UTC 2019 - /srv/jenkins/bin/chroot-run.sh stopped running as /tmp/jenkins-script-CkEWDQro, which will now be removed.
Build step 'Execute shell' marked build as failure

Reply | Threaded
Open this post in threaded view
|

Build failed in Jenkins: lintian-tests_stretch-backports #898

jenkins
See <https://jenkins.debian.net/job/lintian-tests_stretch-backports/898/display/redirect>

------------------------------------------
[...truncated 221.88 KB...]
Adding debian:Baltimore_CyberTrust_Root.pem
Adding debian:Autoridad_de_Certificacion_Firmaprofesional_CIF_A62634068.pem
Adding debian:Atos_TrustedRoot_2011.pem
Adding debian:Amazon_Root_CA_4.pem
Adding debian:Amazon_Root_CA_3.pem
Adding debian:Amazon_Root_CA_2.pem
Adding debian:Amazon_Root_CA_1.pem
Adding debian:AffirmTrust_Premium_ECC.pem
Adding debian:AffirmTrust_Premium.pem
Adding debian:AffirmTrust_Networking.pem
Adding debian:AffirmTrust_Commercial.pem
Adding debian:AddTrust_Low-Value_Services_Root.pem
Adding debian:AddTrust_External_Root.pem
Adding debian:Actalis_Authentication_Root_CA.pem
Warning: there was a problem reading the certificate file /etc/ssl/certs/AC_Ra?z_Certic?mara_S.A..pem. Message:
  /etc/ssl/certs/AC_Ra?z_Certic?mara_S.A..pem (No such file or directory)
Adding debian:AC_RAIZ_FNMT-RCM.pem
Adding debian:ACCVRAIZ1.pem
done.
Setting up dh-autoreconf (17~bpo9+1) ...
Setting up openjdk-8-jdk-headless:amd64 (8u181-b13-2~deb9u1) ...
update-alternatives: using /usr/lib/jvm/java-8-openjdk-amd64/bin/idlj to provide /usr/bin/idlj (idlj) in auto mode
update-alternatives: using /usr/lib/jvm/java-8-openjdk-amd64/bin/jdeps to provide /usr/bin/jdeps (jdeps) in auto mode
update-alternatives: using /usr/lib/jvm/java-8-openjdk-amd64/bin/wsimport to provide /usr/bin/wsimport (wsimport) in auto mode
update-alternatives: using /usr/lib/jvm/java-8-openjdk-amd64/bin/rmic to provide /usr/bin/rmic (rmic) in auto mode
update-alternatives: using /usr/lib/jvm/java-8-openjdk-amd64/bin/jinfo to provide /usr/bin/jinfo (jinfo) in auto mode
update-alternatives: using /usr/lib/jvm/java-8-openjdk-amd64/bin/jsadebugd to provide /usr/bin/jsadebugd (jsadebugd) in auto mode
update-alternatives: using /usr/lib/jvm/java-8-openjdk-amd64/bin/native2ascii to provide /usr/bin/native2ascii (native2ascii) in auto mode
update-alternatives: using /usr/lib/jvm/java-8-openjdk-amd64/bin/jstat to provide /usr/bin/jstat (jstat) in auto mode
update-alternatives: using /usr/lib/jvm/java-8-openjdk-amd64/bin/javac to provide /usr/bin/javac (javac) in auto mode
update-alternatives: using /usr/lib/jvm/java-8-openjdk-amd64/bin/javah to provide /usr/bin/javah (javah) in auto mode
update-alternatives: using /usr/lib/jvm/java-8-openjdk-amd64/bin/jstack to provide /usr/bin/jstack (jstack) in auto mode
update-alternatives: using /usr/lib/jvm/java-8-openjdk-amd64/bin/jrunscript to provide /usr/bin/jrunscript (jrunscript) in auto mode
update-alternatives: using /usr/lib/jvm/java-8-openjdk-amd64/bin/javadoc to provide /usr/bin/javadoc (javadoc) in auto mode
update-alternatives: using /usr/lib/jvm/java-8-openjdk-amd64/bin/javap to provide /usr/bin/javap (javap) in auto mode
update-alternatives: using /usr/lib/jvm/java-8-openjdk-amd64/bin/jar to provide /usr/bin/jar (jar) in auto mode
update-alternatives: using /usr/lib/jvm/java-8-openjdk-amd64/bin/extcheck to provide /usr/bin/extcheck (extcheck) in auto mode
update-alternatives: using /usr/lib/jvm/java-8-openjdk-amd64/bin/schemagen to provide /usr/bin/schemagen (schemagen) in auto mode
update-alternatives: using /usr/lib/jvm/java-8-openjdk-amd64/bin/jps to provide /usr/bin/jps (jps) in auto mode
update-alternatives: using /usr/lib/jvm/java-8-openjdk-amd64/bin/xjc to provide /usr/bin/xjc (xjc) in auto mode
update-alternatives: using /usr/lib/jvm/java-8-openjdk-amd64/bin/jarsigner to provide /usr/bin/jarsigner (jarsigner) in auto mode
update-alternatives: using /usr/lib/jvm/java-8-openjdk-amd64/bin/jmap to provide /usr/bin/jmap (jmap) in auto mode
update-alternatives: using /usr/lib/jvm/java-8-openjdk-amd64/bin/jstatd to provide /usr/bin/jstatd (jstatd) in auto mode
update-alternatives: using /usr/lib/jvm/java-8-openjdk-amd64/bin/jhat to provide /usr/bin/jhat (jhat) in auto mode
update-alternatives: using /usr/lib/jvm/java-8-openjdk-amd64/bin/jdb to provide /usr/bin/jdb (jdb) in auto mode
update-alternatives: using /usr/lib/jvm/java-8-openjdk-amd64/bin/serialver to provide /usr/bin/serialver (serialver) in auto mode
update-alternatives: using /usr/lib/jvm/java-8-openjdk-amd64/bin/wsgen to provide /usr/bin/wsgen (wsgen) in auto mode
update-alternatives: using /usr/lib/jvm/java-8-openjdk-amd64/bin/jcmd to provide /usr/bin/jcmd (jcmd) in auto mode
Setting up default-jre-headless (2:1.8-58) ...
Setting up default-jdk-headless (2:1.8-58) ...
Setting up debhelper (12.1.1~bpo9+1) ...
Setting up pkg-php-tools (1.35) ...
Setting up dh-elpa (1.6) ...
Setting up javahelper (0.59) ...
Setting up lintian-build-deps (2.5.66) ...
Processing triggers for libc-bin (2.24-11+deb9u4) ...
Processing triggers for systemd (232-25+deb9u8) ...
Processing triggers for dictionaries-common (1.27.2) ...
aspell-autobuildhash: processing: en [en-common].
aspell-autobuildhash: processing: en [en-variant_0].
aspell-autobuildhash: processing: en [en-variant_1].
aspell-autobuildhash: processing: en [en-variant_2].
aspell-autobuildhash: processing: en [en-w_accents-only].
aspell-autobuildhash: processing: en [en-wo_accents-only].
aspell-autobuildhash: processing: en [en_AU-variant_0].
aspell-autobuildhash: processing: en [en_AU-variant_1].
aspell-autobuildhash: processing: en [en_AU-w_accents-only].
aspell-autobuildhash: processing: en [en_AU-wo_accents-only].
aspell-autobuildhash: processing: en [en_CA-variant_0].
aspell-autobuildhash: processing: en [en_CA-variant_1].
aspell-autobuildhash: processing: en [en_CA-w_accents-only].
aspell-autobuildhash: processing: en [en_CA-wo_accents-only].
aspell-autobuildhash: processing: en [en_GB-ise-w_accents-only].
aspell-autobuildhash: processing: en [en_GB-ise-wo_accents-only].
aspell-autobuildhash: processing: en [en_GB-ize-w_accents-only].
aspell-autobuildhash: processing: en [en_GB-ize-wo_accents-only].
aspell-autobuildhash: processing: en [en_GB-variant_0].
aspell-autobuildhash: processing: en [en_GB-variant_1].
aspell-autobuildhash: processing: en [en_US-w_accents-only].
aspell-autobuildhash: processing: en [en_US-wo_accents-only].
Processing triggers for ca-certificates (20161130+nmu1+deb9u1) ...
Updating certificates in /etc/ssl/certs...
0 added, 0 removed; done.
Running hooks in /etc/ca-certificates/update.d...

done.
done.
.... running tests ....
mkdir -p "/tmp/testrun/debian/test-out"
t/runtests -k  t "/tmp/testrun/debian/test-out"
ENV[PATH]=/usr/local/sbin:/usr/local/bin:/usr/sbin:/usr/bin:/sbin:/bin
Test scripts:
t/scripts/02-minimum-version/docs-examples.t ....... ok
t/scripts/03-strict/helpers.t ...................... ok
t/scripts/03-strict/docs-examples.t ................ ok
t/scripts/03-strict/frontend.t ..................... ok
t/scripts/01-critic/lib.t .......................... skipped: Perl::Tidy 20170521 required to run this test
t/scripts/01-critic/collection.t ................... skipped: Perl::Tidy 20170521 required to run this test
t/scripts/01-critic/private.t ...................... skipped: Perl::Tidy 20170521 required to run this test
t/scripts/Lintian/DepMap/01add-select-satisfy.t .... ok
t/scripts/01-critic/checks.t ....................... skipped: Perl::Tidy 20170521 required to run this test
t/scripts/01-critic/docs-examples.t ................ skipped: Perl::Tidy 20170521 required to run this test
t/scripts/01-critic/commands.t ..................... skipped: Perl::Tidy 20170521 required to run this test
t/scripts/Lintian/DepMap/03pending.t ............... ok
t/scripts/Lintian/DepMap/04satisfiability.t ........ ok
t/scripts/01-critic/helpers.t ...................... skipped: Perl::Tidy 20170521 required to run this test
t/scripts/Lintian/DepMap/05multi-add.t ............. ok
t/scripts/01-critic/frontend.t ..................... skipped: Perl::Tidy 20170521 required to run this test
t/scripts/01-critic/test-scripts.t ................. skipped: Perl::Tidy 20170521 required to run this test
t/scripts/Lintian/DepMap/06parents.t ............... ok
t/scripts/Lintian/Lab/Manifest/01-basic.t .......... ok
t/scripts/Lintian/Lab/Manifest/02-io.t ............. ok
t/scripts/Lintian/DepMap/08initialise.t ............ ok
t/scripts/Lintian/DepMap/08initialise2.t ........... ok
t/scripts/Lintian/Lab/Manifest/03-diff.t ........... ok
t/scripts/Lintian/DepMap/10circular.t .............. ok
t/scripts/Lintian/DepMap/09unlink.t ................ ok
t/scripts/Lintian/DepMap/11prefix.t ................ ok
t/scripts/Lintian/Relation/01-basic.t .............. ok
t/scripts/Lintian/Relation/02-architecture.t ....... ok
t/scripts/Lintian/DepMap/12done.t .................. ok
t/scripts/02-minimum-version/helpers.t ............. ok
t/scripts/Lintian/Relation/03-duplicates.t ......... ok
t/scripts/Lintian/DepMap/Properties/00construct.t .. ok
t/scripts/Lintian/Relation/04-multiarch.t .......... ok
t/scripts/Lintian/Relation/06-build-profiles.t ..... ok
t/scripts/Lintian/Relation/05-invalid.t ............ ok
t/scripts/Lintian/Relation/07-implies.t ............ ok
t/scripts/Lintian/Util/parse_bool.t ................ ok
t/scripts/Lintian/Util/dctrl-parser.t .............. ok
t/scripts/Lintian/Lab/repair.t ..................... ok
t/scripts/Lintian/Util/path.t ...................... ok

#   Failed test 'ANCIENT_DATE is up to date'
#   at t/scripts/ancient-sv-date.t line 50.
#     '1492334164'
#         <
#     '1451260800'
#  * Please update data/standards-version/ancient-date
# Looks like you failed 1 test of 2.
t/scripts/ancient-sv-date.t ........................
Dubious, test returned 1 (wstat 256, 0x100)
Failed 1/2 subtests
t/scripts/Lintian/Util/run_cmd.t ................... ok
t/scripts/Lintian/Lab/auto-repair.t ................ ok
t/scripts/needs-info-missing.t ..................... ok
t/scripts/changelog-format.t ....................... ok
t/scripts/needs-info-exists.t ...................... ok
t/scripts/pod-coverage.t ........................... ok
t/scripts/implemented-tags.t ....................... ok
t/scripts/unpack-level.t ........................... ok
t/scripts/version.t ................................ ok
t/scripts/pod.t .................................... ok
t/scripts/02-minimum-version/collection.t .......... ok
t/scripts/profiles-coverage.t ...................... ok
t/scripts/03-strict/commands.t ..................... ok
t/scripts/static-lab.t ............................. ok
t/scripts/pod-synopsis.t ........................... ok
t/scripts/profile-load.t ........................... ok
t/scripts/03-strict/collection.t ................... ok
t/scripts/03-strict/private.t ...................... ok
t/scripts/check-load.t ............................. ok
t/scripts/spellintian.t ............................ ok
t/scripts/02-minimum-version/frontend.t ............ ok
t/scripts/check-descs.t ............................ ok
t/scripts/02-minimum-version/private.t ............. ok
t/scripts/pod-spelling.t ........................... ok
t/scripts/02-minimum-version/test-scripts.t ........ ok
t/scripts/03-strict/lib.t .......................... ok
t/scripts/02-minimum-version/commands.t ............ ok
t/scripts/03-strict/checks.t ....................... ok
t/scripts/03-strict/test-scripts.t ................. ok
t/scripts/02-minimum-version/lib.t ................. ok
t/scripts/02-minimum-version/checks.t .............. ok

Test Summary Report
-------------------
t/scripts/ancient-sv-date.t                      (Wstat: 256 Tests: 2 Failed: 1)
  Failed test:  1
  Non-zero exit status: 1
Files=72, Tests=19380, 54 wallclock secs ( 3.71 usr  0.38 sys + 219.37 cusr 41.96 csys = 265.42 CPU)
Result: FAIL

........S............................................S.....................T..T.
............S...............................S...................................
....................................S.............S.S...........................
.......
tests::elpa: ---- START BUILD LOG
tests::elpa: dpkg-buildpackage: warning: using a gain-root-command while being root
tests::elpa: dpkg-buildpackage: info: source package elpa
tests::elpa: dpkg-buildpackage: info: source version 1.0-1
tests::elpa: dpkg-buildpackage: info: source distribution unstable
tests::elpa: dpkg-buildpackage: info: source changed by Debian Lintian Maintainers <[hidden email]>
tests::elpa:  dpkg-source -iNEVER_MATCH_ANYTHING -INEVER_MATCH_ANYTHING --auto-commit --before-build elpa-1.0
tests::elpa: dpkg-buildpackage: info: host architecture amd64
tests::elpa: dpkg-source: warning: unknown information field 'Rules-Requires-Root' in input data in general section of control info file
tests::elpa: dpkg-source: warning: --auto-commit is not a valid option for Dpkg::Source::Package::V1
tests::elpa:  fakeroot debian/rules clean
tests::elpa: dh clean --with elpa
tests::elpa:    dh_clean
tests::elpa:  dpkg-source -iNEVER_MATCH_ANYTHING -INEVER_MATCH_ANYTHING --auto-commit -b elpa-1.0
tests::elpa: dpkg-source: warning: unknown information field 'Rules-Requires-Root' in input data in general section of control info file
tests::elpa: dpkg-source: warning: --auto-commit is not a valid option for Dpkg::Source::Package::V1
tests::elpa: dpkg-source: info: using source format '1.0'
tests::elpa: dpkg-source: info: building elpa using existing elpa_1.0.orig.tar.gz
tests::elpa: dpkg-source: info: building elpa in elpa_1.0-1.diff.gz
tests::elpa: dpkg-source: warning: executable mode 0755 of 'debian/tests/test' will not be represented in diff
tests::elpa: dpkg-source: warning: the diff modifies the following upstream files:
tests::elpa:  foo.el
tests::elpa: dpkg-source: info: use the '3.0 (quilt)' format to have separate and documented changes to upstream files, see dpkg-source(1)
tests::elpa: dpkg-source: info: building elpa in elpa_1.0-1.dsc
tests::elpa:  debian/rules build
tests::elpa: dh build --with elpa
tests::elpa:    dh_update_autotools_config
tests::elpa:    dh_autoreconf
tests::elpa:    dh_elpa_test
tests::elpa: Invalid field given (Rules_Requires_Root) at /usr/share/perl5/Debian/Control.pm line 122.
tests::elpa: debian/rules:4: recipe for target 'build' failed
tests::elpa: make: *** [build] Error 255
tests::elpa: dpkg-buildpackage: error: debian/rules build gave error exit status 2
tests::elpa: ---- END BUILD LOG
error tests::elpa: internal error: cd /tmp/testrun/debian/test-out/tests/elpa/elpa-1.0 && dpkg-buildpackage -rfakeroot -us -uc -d -iNEVER_MATCH_ANYTHING -INEVER_MATCH_ANYTHING --source-option=--auto-commit >/tmp/testrun/debian/test-out/tests/elpa/build.elpa 2>&1 at t/runtests line 466.

................................................................................
................................................................................
......................................................................S.........
................................S....S..........................................
......
Skipped/disabled tests:
  [debs]
    deb-format-wrong-order: Unmet test dependencies: dpkg (<< 1.17.2)
  [tests]
    binaries-missing-lfs: architecture mismatch
    changelog-file-strange-date: Unmet test dependencies: dpkg (<< 1.18.2)
    deb-format-udeb-compression: Unmet test dependencies: dpkg (<< 1.18.11)
    debhelper-compat: Unmet test dependencies: debhelper (<< 9.20151101~)
    debhelper-compat-empty: Unmet test dependencies: debhelper (<< 9.20151101~)
    runtests-arch-i386: architecture mismatch
    shared-libs-non-pic-i386: architecture mismatch
    upstream-metadata-invalid-yml: (disabled) YAML::XS executes code by default and code has not been converted
    version-substvars-obsolete: Unmet test dependencies: dpkg (<< 1.17.2)

Failed tests (2)
    suite:scripts [Try: prove -lr -j24 t]
    tests::elpa
debian/rules:48: recipe for target 'runtests' failed
make: *** [runtests] Error 1
Tue 16 Apr 09:21:39 UTC 2019 - /srv/jenkins/bin/chroot-run.sh stopped running as /tmp/jenkins-script-sse9m9wS, which will now be removed.
Build step 'Execute shell' marked build as failure

Reply | Threaded
Open this post in threaded view
|

Jenkins build is back to normal : lintian-tests_stretch-backports #899

jenkins